Issues building proxy locally

I’m sure that I’m missing something with my environment but proxy is not building. I’ve built stock envoy before and have all the dependencies. And I’ve set up my user.bazelrc but I keep getting missing libc++ headers. Here’s the output of running make.

➜ proxy git:(master) make
#TODO(lambdai): Prerun v8//:build if and only if BAZEL_TARGETS depends on v8.
export PATH=/usr/lib/llvm-10/bin:/home/jm/google-cloud-sdk/bin:/home/jm/.serverless/bin:/home/jm/go/bin:/home/jm/.serverless/bin:/home/jm/google-cloud-sdk/bin:/home/jm/.serverless/bin:/home/jm/go/bin:/home/jm/.serverless/bin:/home/jm/.serverless/bin:/home/jm/go/bin:/home/jm/.serverless/bin:/usr/local/sbin:/usr/local/bin:/usr/sbin:/usr/bin:/sbin:/bin:/usr/games:/usr/local/games:/snap/bin:/usr/local/go/bin:/home/jm/bin:/bin:/usr/local/go/bin:/home/jm/bin:/bin//home/jm/google-cloud-sdk/bin:/usr/local/go/bin:/home/jm/bin:/bin//home/jm/google-cloud-sdk/bin:/home/jm/istio-1.10.0/bin CC=clang CXX=clang++ &&
bazel build --config=libc++ @com_googlesource_chromium_v8//:build &&
bazel build --config=libc++ //…
WARNING: The following configs were expanded more than once: [clang]. For repeatable flags, repeats are counted twice and may lead to unexpected behavior.
INFO: Analyzed target @com_googlesource_chromium_v8//:build (0 packages loaded, 0 targets configured).
INFO: Found 1 target…
ERROR: /home/jm/.cache/bazel/_bazel_jm/4339077292f77aea3e5e054e93345268/external/com_googlesource_chromium_v8/BUILD.bazel:34:8: Executing genrule @com_googlesource_chromium_v8//:build failed (Exit 1): bash failed: error executing command /bin/bash -c … (remaining 1 argument(s) skipped)

Use --sandbox_debug to see verbose messages from the sandbox bash failed: error executing command /bin/bash -c … (remaining 1 argument(s) skipped)

Use --sandbox_debug to see verbose messages from the sandbox
/home/jm/.cache/bazel/bazel_jm/4339077292f77aea3e5e054e93345268/sandbox/linux-sandbox/5/execroot/io_istio_proxy/external/com_googlesource_chromium_v8/wee8 /home/jm/.cache/bazel/bazel_jm/4339077292f77aea3e5e054e93345268/sandbox/linux-sandbox/5/execroot/io_istio_proxy
Done. Made 160 targets from 87 files in 207ms
ninja: Entering directory `out/wee8’
[1/1243] CXX obj/cppgc_base/default-platform.o
FAILED: obj/cppgc_base/default-platform.o
clang++ -MMD -MF obj/cppgc_base/default-platform.o.d -DUSE_UDEV -DUSE_AURA=1 -DUSE_NSS_CERTS=1 -DUSE_OZONE=1 -DUSE_X11=1 -D_FILE_OFFSET_BITS=64 -D_LARGEFILE_SOURCE -D_LARGEFILE64_SOURCE -D_GNU_SOURCE -DCR_CLANG_REVISION="" -D__STDC_CONSTANT_MACROS -D__STDC_FORMAT_MACROS -D_FORTIFY_SOURCE=2 -DNDEBUG -DNVALGRIND -DDYNAMIC_ANNOTATIONS_ENABLED=0 -DV8_TYPED_ARRAY_MAX_SIZE_IN_HEAP=64 -DENABLE_MINOR_MC -DV8_ATOMIC_OBJECT_FIELD_WRITES -DV8_ATOMIC_MARKING_STATE -DV8_ENABLE_LAZY_SOURCE_POSITIONS -DV8_WIN64_UNWINDING_INFO -DV8_ENABLE_REGEXP_INTERPRETER_THREADED_DISPATCH -DV8_SNAPSHOT_COMPRESSION -DV8_SHORT_BUILTIN_CALLS -DV8_ENABLE_SYSTEM_INSTRUMENTATION -DV8_ENABLE_WEBASSEMBLY -DV8_COMPRESS_POINTERS -DV8_COMPRESS_POINTERS_IN_ISOLATE_CAGE -DV8_31BIT_SMIS_ON_64BIT_ARCH -DV8_DEPRECATION_WARNINGS -DV8_IMMINENT_DEPRECATION_WARNINGS -DCPPGC_CAGED_HEAP -DV8_TARGET_ARCH_X64 -DV8_HAVE_TARGET_OS -DV8_TARGET_OS_LINUX -DDISABLE_UNTRUSTED_CODE_MITIGATIONS -DV8_COMPRESS_POINTERS -DV8_COMPRESS_POINTERS_IN_ISOLATE_CAGE -DV8_31BIT_SMIS_ON_64BIT_ARCH -DV8_DEPRECATION_WARNINGS -DV8_IMMINENT_DEPRECATION_WARNINGS -DCPPGC_CAGED_HEAP -DV8_COMPRESS_POINTERS -DV8_COMPRESS_POINTERS_IN_ISOLATE_CAGE -DV8_31BIT_SMIS_ON_64BIT_ARCH -DV8_DEPRECATION_WARNINGS -DV8_IMMINENT_DEPRECATION_WARNINGS -DCPPGC_CAGED_HEAP -I…/… -Igen -I…/… -I…/…/include -Igen -Igen/include -Igen/include -I…/…/include -fno-delete-null-pointer-checks -fno-ident -fno-strict-aliasing --param=ssp-buffer-size=4 -fstack-protector -funwind-tables -fPIC -pthread -fcolor-diagnostics -fmerge-all-constants -m64 -march=x86-64 -msse3 -Wno-builtin-macro-redefined -D__DATE
= -D__TIME__= -D__TIMESTAMP__= -Xclang -fdebug-compilation-dir -Xclang . -no-canonical-prefixes -Wall -Werror -Wextra -Wimplicit-fallthrough -Wunreachable-code -Wthread-safety -Wextra-semi -Wno-missing-field-initializers -Wno-unused-parameter -Wno-c++11-narrowing -Wno-unneeded-internal-declaration -Wno-undefined-var-template -fno-omit-frame-pointer -Wheader-hygiene -Wstring-conversion -Wtautological-overlap-compare -Wmissing-field-initializers -Wunreachable-code -Wshorten-64-to-32 -O3 -fdata-sections -ffunction-sections -g1 -fvisibility=default -Wexit-time-destructors -std=c++14 -fno-trigraphs -Wno-trigraphs -fno-exceptions -fno-rtti -stdlib=libc++ -Wno-unused-variable -Wno-sign-compare -Wno-deprecated-copy -Wno-unknown-warning-option -Wno-range-loop-analysis -Wno-shorten-64-to-32 -Wno-implicit-int-float-conversion -Wno-builtin-assume-aligned-alignment -Wno-final-dtor-non-final-class -c …/…/src/heap/cppgc/default-platform.cc -o obj/cppgc_base/default-platform.o
In file included from …/…/src/heap/cppgc/default-platform.cc:5:
…/…/include/cppgc/default-platform.h:8:10: fatal error: ‘memory’ file not found
#include
^~~~~~~~
1 error generated.
[2/1243] CXX obj/cppgc_base/allocation.o
FAILED: obj/cppgc_base/allocation.o
clang++ -MMD -MF obj/cppgc_base/allocation.o.d -DUSE_UDEV -DUSE_AURA=1 -DUSE_NSS_CERTS=1 -DUSE_OZONE=1 -DUSE_X11=1 -D_FILE_OFFSET_BITS=64 -D_LARGEFILE_SOURCE -D_LARGEFILE64_SOURCE -D_GNU_SOURCE -DCR_CLANG_REVISION="" -D__STDC_CONSTANT_MACROS -D__STDC_FORMAT_MACROS -D_FORTIFY_SOURCE=2 -DNDEBUG -DNVALGRIND -DDYNAMIC_ANNOTATIONS_ENABLED=0 -DV8_TYPED_ARRAY_MAX_SIZE_IN_HEAP=64 -DENABLE_MINOR_MC -DV8_ATOMIC_OBJECT_FIELD_WRITES -DV8_ATOMIC_MARKING_STATE -DV8_ENABLE_LAZY_SOURCE_POSITIONS -DV8_WIN64_UNWINDING_INFO -DV8_ENABLE_REGEXP_INTERPRETER_THREADED_DISPATCH -DV8_SNAPSHOT_COMPRESSION -DV8_SHORT_BUILTIN_CALLS -DV8_ENABLE_SYSTEM_INSTRUMENTATION -DV8_ENABLE_WEBASSEMBLY -DV8_COMPRESS_POINTERS -DV8_COMPRESS_POINTERS_IN_ISOLATE_CAGE -DV8_31BIT_SMIS_ON_64BIT_ARCH -DV8_DEPRECATION_WARNINGS -DV8_IMMINENT_DEPRECATION_WARNINGS -DCPPGC_CAGED_HEAP -DV8_TARGET_ARCH_X64 -DV8_HAVE_TARGET_OS -DV8_TARGET_OS_LINUX -DDISABLE_UNTRUSTED_CODE_MITIGATIONS -DV8_COMPRESS_POINTERS -DV8_COMPRESS_POINTERS_IN_ISOLATE_CAGE -DV8_31BIT_SMIS_ON_64BIT_ARCH -DV8_DEPRECATION_WARNINGS -DV8_IMMINENT_DEPRECATION_WARNINGS -DCPPGC_CAGED_HEAP -DV8_COMPRESS_POINTERS -DV8_COMPRESS_POINTERS_IN_ISOLATE_CAGE -DV8_31BIT_SMIS_ON_64BIT_ARCH -DV8_DEPRECATION_WARNINGS -DV8_IMMINENT_DEPRECATION_WARNINGS -DCPPGC_CAGED_HEAP -I…/… -Igen -I…/… -I…/…/include -Igen -Igen/include -Igen/include -I…/…/include -fno-delete-null-pointer-checks -fno-ident -fno-strict-aliasing --param=ssp-buffer-size=4 -fstack-protector -funwind-tables -fPIC -pthread -fcolor-diagnostics -fmerge-all-constants -m64 -march=x86-64 -msse3 -Wno-builtin-macro-redefined -D__DATE__= -D__TIME__= -D__TIMESTAMP__= -Xclang -fdebug-compilation-dir -Xclang . -no-canonical-prefixes -Wall -Werror -Wextra -Wimplicit-fallthrough -Wunreachable-code -Wthread-safety -Wextra-semi -Wno-missing-field-initializers -Wno-unused-parameter -Wno-c++11-narrowing -Wno-unneeded-internal-declaration -Wno-undefined-var-template -fno-omit-frame-pointer -Wheader-hygiene -Wstring-conversion -Wtautological-overlap-compare -Wmissing-field-initializers -Wunreachable-code -Wshorten-64-to-32 -O3 -fdata-sections -ffunction-sections -g1 -fvisibility=default -Wexit-time-destructors -std=c++14 -fno-trigraphs -Wno-trigraphs -fno-exceptions -fno-rtti -stdlib=libc++ -Wno-unused-variable -Wno-sign-compare -Wno-deprecated-copy -Wno-unknown-warning-option -Wno-range-loop-analysis -Wno-shorten-64-to-32 -Wno-implicit-int-float-conversion -Wno-builtin-assume-aligned-alignment -Wno-final-dtor-non-final-class -c …/…/src/heap/cppgc/allocation.cc -o obj/cppgc_base/allocation.o
In file included from …/…/src/heap/cppgc/allocation.cc:5:
…/…/include/cppgc/allocation.h:10:10: fatal error: ‘atomic’ file not found
#include
^~~~~~~~
1 error generated.
[3/1243] CXX obj/cppgc_base/free-list.o
FAILED: obj/cppgc_base/free-list.o
clang++ -MMD -MF obj/cppgc_base/free-list.o.d -DUSE_UDEV -DUSE_AURA=1 -DUSE_NSS_CERTS=1 -DUSE_OZONE=1 -DUSE_X11=1 -D_FILE_OFFSET_BITS=64 -D_LARGEFILE_SOURCE -D_LARGEFILE64_SOURCE -D_GNU_SOURCE -DCR_CLANG_REVISION="" -D__STDC_CONSTANT_MACROS -D__STDC_FORMAT_MACROS -D_FORTIFY_SOURCE=2 -DNDEBUG -DNVALGRIND -DDYNAMIC_ANNOTATIONS_ENABLED=0 -DV8_TYPED_ARRAY_MAX_SIZE_IN_HEAP=64 -DENABLE_MINOR_MC -DV8_ATOMIC_OBJECT_FIELD_WRITES -DV8_ATOMIC_MARKING_STATE -DV8_ENABLE_LAZY_SOURCE_POSITIONS -DV8_WIN64_UNWINDING_INFO -DV8_ENABLE_REGEXP_INTERPRETER_THREADED_DISPATCH -DV8_SNAPSHOT_COMPRESSION -DV8_SHORT_BUILTIN_CALLS -DV8_ENABLE_SYSTEM_INSTRUMENTATION -DV8_ENABLE_WEBASSEMBLY -DV8_COMPRESS_POINTERS -DV8_COMPRESS_POINTERS_IN_ISOLATE_CAGE -DV8_31BIT_SMIS_ON_64BIT_ARCH -DV8_DEPRECATION_WARNINGS -DV8_IMMINENT_DEPRECATION_WARNINGS -DCPPGC_CAGED_HEAP -DV8_TARGET_ARCH_X64 -DV8_HAVE_TARGET_OS -DV8_TARGET_OS_LINUX -DDISABLE_UNTRUSTED_CODE_MITIGATIONS -DV8_COMPRESS_POINTERS -DV8_COMPRESS_POINTERS_IN_ISOLATE_CAGE -DV8_31BIT_SMIS_ON_64BIT_ARCH -DV8_DEPRECATION_WARNINGS -DV8_IMMINENT_DEPRECATION_WARNINGS -DCPPGC_CAGED_HEAP -DV8_COMPRESS_POINTERS -DV8_COMPRESS_POINTERS_IN_ISOLATE_CAGE -DV8_31BIT_SMIS_ON_64BIT_ARCH -DV8_DEPRECATION_WARNINGS -DV8_IMMINENT_DEPRECATION_WARNINGS -DCPPGC_CAGED_HEAP -I…/… -Igen -I…/… -I…/…/include -Igen -Igen/include -Igen/include -I…/…/include -fno-delete-null-pointer-checks -fno-ident -fno-strict-aliasing --param=ssp-buffer-size=4 -fstack-protector -funwind-tables -fPIC -pthread -fcolor-diagnostics -fmerge-all-constants -m64 -march=x86-64 -msse3 -Wno-builtin-macro-redefined -D__DATE__= -D__TIME__= -D__TIMESTAMP__= -Xclang -fdebug-compilation-dir -Xclang . -no-canonical-prefixes -Wall -Werror -Wextra -Wimplicit-fallthrough -Wunreachable-code -Wthread-safety -Wextra-semi -Wno-missing-field-initializers -Wno-unused-parameter -Wno-c++11-narrowing -Wno-unneeded-internal-declaration -Wno-undefined-var-template -fno-omit-frame-pointer -Wheader-hygiene -Wstring-conversion -Wtautological-overlap-compare -Wmissing-field-initializers -Wunreachable-code -Wshorten-64-to-32 -O3 -fdata-sections -ffunction-sections -g1 -fvisibility=default -Wexit-time-destructors -std=c++14 -fno-trigraphs -Wno-trigraphs -fno-exceptions -fno-rtti -stdlib=libc++ -Wno-unused-variable -Wno-sign-compare -Wno-deprecated-copy -Wno-unknown-warning-option -Wno-range-loop-analysis -Wno-shorten-64-to-32 -Wno-implicit-int-float-conversion -Wno-builtin-assume-aligned-alignment -Wno-final-dtor-non-final-class -c …/…/src/heap/cppgc/free-list.cc -o obj/cppgc_base/free-list.o
In file included from …/…/src/heap/cppgc/free-list.cc:5:
…/…/src/heap/cppgc/free-list.h:8:10: fatal error: ‘array’ file not found
#include
^~~~~~~
1 error generated.
[4/1243] CXX obj/cppgc_base/compaction-worklists.o
FAILED: obj/cppgc_base/compaction-worklists.o
clang++ -MMD -MF obj/cppgc_base/compaction-worklists.o.d -DUSE_UDEV -DUSE_AURA=1 -DUSE_NSS_CERTS=1 -DUSE_OZONE=1 -DUSE_X11=1 -D_FILE_OFFSET_BITS=64 -D_LARGEFILE_SOURCE -D_LARGEFILE64_SOURCE -D_GNU_SOURCE -DCR_CLANG_REVISION="" -D__STDC_CONSTANT_MACROS -D__STDC_FORMAT_MACROS -D_FORTIFY_SOURCE=2 -DNDEBUG -DNVALGRIND -DDYNAMIC_ANNOTATIONS_ENABLED=0 -DV8_TYPED_ARRAY_MAX_SIZE_IN_HEAP=64 -DENABLE_MINOR_MC -DV8_ATOMIC_OBJECT_FIELD_WRITES -DV8_ATOMIC_MARKING_STATE -DV8_ENABLE_LAZY_SOURCE_POSITIONS -DV8_WIN64_UNWINDING_INFO -DV8_ENABLE_REGEXP_INTERPRETER_THREADED_DISPATCH -DV8_SNAPSHOT_COMPRESSION -DV8_SHORT_BUILTIN_CALLS -DV8_ENABLE_SYSTEM_INSTRUMENTATION -DV8_ENABLE_WEBASSEMBLY -DV8_COMPRESS_POINTERS -DV8_COMPRESS_POINTERS_IN_ISOLATE_CAGE -DV8_31BIT_SMIS_ON_64BIT_ARCH -DV8_DEPRECATION_WARNINGS -DV8_IMMINENT_DEPRECATION_WARNINGS -DCPPGC_CAGED_HEAP -DV8_TARGET_ARCH_X64 -DV8_HAVE_TARGET_OS -DV8_TARGET_OS_LINUX -DDISABLE_UNTRUSTED_CODE_MITIGATIONS -DV8_COMPRESS_POINTERS -DV8_COMPRESS_POINTERS_IN_ISOLATE_CAGE -DV8_31BIT_SMIS_ON_64BIT_ARCH -DV8_DEPRECATION_WARNINGS -DV8_IMMINENT_DEPRECATION_WARNINGS -DCPPGC_CAGED_HEAP -DV8_COMPRESS_POINTERS -DV8_COMPRESS_POINTERS_IN_ISOLATE_CAGE -DV8_31BIT_SMIS_ON_64BIT_ARCH -DV8_DEPRECATION_WARNINGS -DV8_IMMINENT_DEPRECATION_WARNINGS -DCPPGC_CAGED_HEAP -I…/… -Igen -I…/… -I…/…/include -Igen -Igen/include -Igen/include -I…/…/include -fno-delete-null-pointer-checks -fno-ident -fno-strict-aliasing --param=ssp-buffer-size=4 -fstack-protector -funwind-tables -fPIC -pthread -fcolor-diagnostics -fmerge-all-constants -m64 -march=x86-64 -msse3 -Wno-builtin-macro-redefined -D__DATE__= -D__TIME__= -D__TIMESTAMP__= -Xclang -fdebug-compilation-dir -Xclang . -no-canonical-prefixes -Wall -Werror -Wextra -Wimplicit-fallthrough -Wunreachable-code -Wthread-safety -Wextra-semi -Wno-missing-field-initializers -Wno-unused-parameter -Wno-c++11-narrowing -Wno-unneeded-internal-declaration -Wno-undefined-var-template -fno-omit-frame-pointer -Wheader-hygiene -Wstring-conversion -Wtautological-overlap-compare -Wmissing-field-initializers -Wunreachable-code -Wshorten-64-to-32 -O3 -fdata-sections -ffunction-sections -g1 -fvisibility=default -Wexit-time-destructors -std=c++14 -fno-trigraphs -Wno-trigraphs -fno-exceptions -fno-rtti -stdlib=libc++ -Wno-unused-variable -Wno-sign-compare -Wno-deprecated-copy -Wno-unknown-warning-option -Wno-range-loop-analysis -Wno-shorten-64-to-32 -Wno-implicit-int-float-conversion -Wno-builtin-assume-aligned-alignment -Wno-final-dtor-non-final-class -c …/…/src/heap/cppgc/compaction-worklists.cc -o obj/cppgc_base/compaction-worklists.o
In file included from …/…/src/heap/cppgc/compaction-worklists.cc:6:
…/…/src/heap/cppgc/compaction-worklists.h:8:10: fatal error: ‘unordered_set’ file not found
#include <unordered_set>
^~~~~~~~~~~~~~~
1 error generated.
[5/1243] CXX obj/cppgc_base/gc-info-table.o
FAILED: obj/cppgc_base/gc-info-table.o
clang++ -MMD -MF obj/cppgc_base/gc-info-table.o.d -DUSE_UDEV -DUSE_AURA=1 -DUSE_NSS_CERTS=1 -DUSE_OZONE=1 -DUSE_X11=1 -D_FILE_OFFSET_BITS=64 -D_LARGEFILE_SOURCE -D_LARGEFILE64_SOURCE -D_GNU_SOURCE -DCR_CLANG_REVISION="" -D__STDC_CONSTANT_MACROS -D__STDC_FORMAT_MACROS -D_FORTIFY_SOURCE=2 -DNDEBUG -DNVALGRIND -DDYNAMIC_ANNOTATIONS_ENABLED=0 -DV8_TYPED_ARRAY_MAX_SIZE_IN_HEAP=64 -DENABLE_MINOR_MC -DV8_ATOMIC_OBJECT_FIELD_WRITES -DV8_ATOMIC_MARKING_STATE -DV8_ENABLE_LAZY_SOURCE_POSITIONS -DV8_WIN64_UNWINDING_INFO -DV8_ENABLE_REGEXP_INTERPRETER_THREADED_DISPATCH -DV8_SNAPSHOT_COMPRESSION -DV8_SHORT_BUILTIN_CALLS -DV8_ENABLE_SYSTEM_INSTRUMENTATION -DV8_ENABLE_WEBASSEMBLY -DV8_COMPRESS_POINTERS -DV8_COMPRESS_POINTERS_IN_ISOLATE_CAGE -DV8_31BIT_SMIS_ON_64BIT_ARCH -DV8_DEPRECATION_WARNINGS -DV8_IMMINENT_DEPRECATION_WARNINGS -DCPPGC_CAGED_HEAP -DV8_TARGET_ARCH_X64 -DV8_HAVE_TARGET_OS -DV8_TARGET_OS_LINUX -DDISABLE_UNTRUSTED_CODE_MITIGATIONS -DV8_COMPRESS_POINTERS -DV8_COMPRESS_POINTERS_IN_ISOLATE_CAGE -DV8_31BIT_SMIS_ON_64BIT_ARCH -DV8_DEPRECATION_WARNINGS -DV8_IMMINENT_DEPRECATION_WARNINGS -DCPPGC_CAGED_HEAP -DV8_COMPRESS_POINTERS -DV8_COMPRESS_POINTERS_IN_ISOLATE_CAGE -DV8_31BIT_SMIS_ON_64BIT_ARCH -DV8_DEPRECATION_WARNINGS -DV8_IMMINENT_DEPRECATION_WARNINGS -DCPPGC_CAGED_HEAP -I…/… -Igen -I…/… -I…/…/include -Igen -Igen/include -Igen/include -I…/…/include -fno-delete-null-pointer-checks -fno-ident -fno-strict-aliasing --param=ssp-buffer-size=4 -fstack-protector -funwind-tables -fPIC -pthread -fcolor-diagnostics -fmerge-all-constants -m64 -march=x86-64 -msse3 -Wno-builtin-macro-redefined -D__DATE__= -D__TIME__= -D__TIMESTAMP__= -Xclang -fdebug-compilation-dir -Xclang . -no-canonical-prefixes -Wall -Werror -Wextra -Wimplicit-fallthrough -Wunreachable-code -Wthread-safety -Wextra-semi -Wno-missing-field-initializers -Wno-unused-parameter -Wno-c++11-narrowing -Wno-unneeded-internal-declaration -Wno-undefined-var-template -fno-omit-frame-pointer -Wheader-hygiene -Wstring-conversion -Wtautological-overlap-compare -Wmissing-field-initializers -Wunreachable-code -Wshorten-64-to-32 -O3 -fdata-sections -ffunction-sections -g1 -fvisibility=default -Wexit-time-destructors -std=c++14 -fno-trigraphs -Wno-trigraphs -fno-exceptions -fno-rtti -stdlib=libc++ -Wno-unused-variable -Wno-sign-compare -Wno-deprecated-copy -Wno-unknown-warning-option -Wno-range-loop-analysis -Wno-shorten-64-to-32 -Wno-implicit-int-float-conversion -Wno-builtin-assume-aligned-alignment -Wno-final-dtor-non-final-class -c …/…/src/heap/cppgc/gc-info-table.cc -o obj/cppgc_base/gc-info-table.o
In file included from …/…/src/heap/cppgc/gc-info-table.cc:5:
In file included from …/…/src/heap/cppgc/gc-info-table.h:10:
…/…/include/cppgc/internal/gc-info.h:8:10: fatal error: ‘atomic’ file not found
#include
^~~~~~~~
1 error generated.
[6/1243] CXX obj/cppgc_base/explicit-management.o
FAILED: obj/cppgc_base/explicit-management.o
clang++ -MMD -MF obj/cppgc_base/explicit-management.o.d -DUSE_UDEV -DUSE_AURA=1 -DUSE_NSS_CERTS=1 -DUSE_OZONE=1 -DUSE_X11=1 -D_FILE_OFFSET_BITS=64 -D_LARGEFILE_SOURCE -D_LARGEFILE64_SOURCE -D_GNU_SOURCE -DCR_CLANG_REVISION="" -D__STDC_CONSTANT_MACROS -D__STDC_FORMAT_MACROS -D_FORTIFY_SOURCE=2 -DNDEBUG -DNVALGRIND -DDYNAMIC_ANNOTATIONS_ENABLED=0 -DV8_TYPED_ARRAY_MAX_SIZE_IN_HEAP=64 -DENABLE_MINOR_MC -DV8_ATOMIC_OBJECT_FIELD_WRITES -DV8_ATOMIC_MARKING_STATE -DV8_ENABLE_LAZY_SOURCE_POSITIONS -DV8_WIN64_UNWINDING_INFO -DV8_ENABLE_REGEXP_INTERPRETER_THREADED_DISPATCH -DV8_SNAPSHOT_COMPRESSION -DV8_SHORT_BUILTIN_CALLS -DV8_ENABLE_SYSTEM_INSTRUMENTATION -DV8_ENABLE_WEBASSEMBLY -DV8_COMPRESS_POINTERS -DV8_COMPRESS_POINTERS_IN_ISOLATE_CAGE -DV8_31BIT_SMIS_ON_64BIT_ARCH -DV8_DEPRECATION_WARNINGS -DV8_IMMINENT_DEPRECATION_WARNINGS -DCPPGC_CAGED_HEAP -DV8_TARGET_ARCH_X64 -DV8_HAVE_TARGET_OS -DV8_TARGET_OS_LINUX -DDISABLE_UNTRUSTED_CODE_MITIGATIONS -DV8_COMPRESS_POINTERS -DV8_COMPRESS_POINTERS_IN_ISOLATE_CAGE -DV8_31BIT_SMIS_ON_64BIT_ARCH -DV8_DEPRECATION_WARNINGS -DV8_IMMINENT_DEPRECATION_WARNINGS -DCPPGC_CAGED_HEAP -DV8_COMPRESS_POINTERS -DV8_COMPRESS_POINTERS_IN_ISOLATE_CAGE -DV8_31BIT_SMIS_ON_64BIT_ARCH -DV8_DEPRECATION_WARNINGS -DV8_IMMINENT_DEPRECATION_WARNINGS -DCPPGC_CAGED_HEAP -I…/… -Igen -I…/… -I…/…/include -Igen -Igen/include -Igen/include -I…/…/include -fno-delete-null-pointer-checks -fno-ident -fno-strict-aliasing --param=ssp-buffer-size=4 -fstack-protector -funwind-tables -fPIC -pthread -fcolor-diagnostics -fmerge-all-constants -m64 -march=x86-64 -msse3 -Wno-builtin-macro-redefined -D__DATE__= -D__TIME__= -D__TIMESTAMP__= -Xclang -fdebug-compilation-dir -Xclang . -no-canonical-prefixes -Wall -Werror -Wextra -Wimplicit-fallthrough -Wunreachable-code -Wthread-safety -Wextra-semi -Wno-missing-field-initializers -Wno-unused-parameter -Wno-c++11-narrowing -Wno-unneeded-internal-declaration -Wno-undefined-var-template -fno-omit-frame-pointer -Wheader-hygiene -Wstring-conversion -Wtautological-overlap-compare -Wmissing-field-initializers -Wunreachable-code -Wshorten-64-to-32 -O3 -fdata-sections -ffunction-sections -g1 -fvisibility=default -Wexit-time-destructors -std=c++14 -fno-trigraphs -Wno-trigraphs -fno-exceptions -fno-rtti -stdlib=libc++ -Wno-unused-variable -Wno-sign-compare -Wno-deprecated-copy -Wno-unknown-warning-option -Wno-range-loop-analysis -Wno-shorten-64-to-32 -Wno-implicit-int-float-conversion -Wno-builtin-assume-aligned-alignment -Wno-final-dtor-non-final-class -c …/…/src/heap/cppgc/explicit-management.cc -o obj/cppgc_base/explicit-management.o
In file included from …/…/src/heap/cppgc/explicit-management.cc:5:
…/…/include/cppgc/explicit-management.h:8:10: fatal error: ‘cstddef’ file not found
#include
^~~~~~~~~
1 error generated.
[7/1243] CXX obj/cppgc_base/compactor.o
FAILED: obj/cppgc_base/compactor.o
clang++ -MMD -MF obj/cppgc_base/compactor.o.d -DUSE_UDEV -DUSE_AURA=1 -DUSE_NSS_CERTS=1 -DUSE_OZONE=1 -DUSE_X11=1 -D_FILE_OFFSET_BITS=64 -D_LARGEFILE_SOURCE -D_LARGEFILE64_SOURCE -D_GNU_SOURCE -DCR_CLANG_REVISION="" -D__STDC_CONSTANT_MACROS -D__STDC_FORMAT_MACROS -D_FORTIFY_SOURCE=2 -DNDEBUG -DNVALGRIND -DDYNAMIC_ANNOTATIONS_ENABLED=0 -DV8_TYPED_ARRAY_MAX_SIZE_IN_HEAP=64 -DENABLE_MINOR_MC -DV8_ATOMIC_OBJECT_FIELD_WRITES -DV8_ATOMIC_MARKING_STATE -DV8_ENABLE_LAZY_SOURCE_POSITIONS -DV8_WIN64_UNWINDING_INFO -DV8_ENABLE_REGEXP_INTERPRETER_THREADED_DISPATCH -DV8_SNAPSHOT_COMPRESSION -DV8_SHORT_BUILTIN_CALLS -DV8_ENABLE_SYSTEM_INSTRUMENTATION -DV8_ENABLE_WEBASSEMBLY -DV8_COMPRESS_POINTERS -DV8_COMPRESS_POINTERS_IN_ISOLATE_CAGE -DV8_31BIT_SMIS_ON_64BIT_ARCH -DV8_DEPRECATION_WARNINGS -DV8_IMMINENT_DEPRECATION_WARNINGS -DCPPGC_CAGED_HEAP -DV8_TARGET_ARCH_X64 -DV8_HAVE_TARGET_OS -DV8_TARGET_OS_LINUX -DDISABLE_UNTRUSTED_CODE_MITIGATIONS -DV8_COMPRESS_POINTERS -DV8_COMPRESS_POINTERS_IN_ISOLATE_CAGE -DV8_31BIT_SMIS_ON_64BIT_ARCH -DV8_DEPRECATION_WARNINGS -DV8_IMMINENT_DEPRECATION_WARNINGS -DCPPGC_CAGED_HEAP -DV8_COMPRESS_POINTERS -DV8_COMPRESS_POINTERS_IN_ISOLATE_CAGE -DV8_31BIT_SMIS_ON_64BIT_ARCH -DV8_DEPRECATION_WARNINGS -DV8_IMMINENT_DEPRECATION_WARNINGS -DCPPGC_CAGED_HEAP -I…/… -Igen -I…/… -I…/…/include -Igen -Igen/include -Igen/include -I…/…/include -fno-delete-null-pointer-checks -fno-ident -fno-strict-aliasing --param=ssp-buffer-size=4 -fstack-protector -funwind-tables -fPIC -pthread -fcolor-diagnostics -fmerge-all-constants -m64 -march=x86-64 -msse3 -Wno-builtin-macro-redefined -D__DATE__= -D__TIME__= -D__TIMESTAMP__= -Xclang -fdebug-compilation-dir -Xclang . -no-canonical-prefixes -Wall -Werror -Wextra -Wimplicit-fallthrough -Wunreachable-code -Wthread-safety -Wextra-semi -Wno-missing-field-initializers -Wno-unused-parameter -Wno-c++11-narrowing -Wno-unneeded-internal-declaration -Wno-undefined-var-template -fno-omit-frame-pointer -Wheader-hygiene -Wstring-conversion -Wtautological-overlap-compare -Wmissing-field-initializers -Wunreachable-code -Wshorten-64-to-32 -O3 -fdata-sections -ffunction-sections -g1 -fvisibility=default -Wexit-time-destructors -std=c++14 -fno-trigraphs -Wno-trigraphs -fno-exceptions -fno-rtti -stdlib=libc++ -Wno-unused-variable -Wno-sign-compare -Wno-deprecated-copy -Wno-unknown-warning-option -Wno-range-loop-analysis -Wno-shorten-64-to-32 -Wno-implicit-int-float-conversion -Wno-builtin-assume-aligned-alignment -Wno-final-dtor-non-final-class -c …/…/src/heap/cppgc/compactor.cc -o obj/cppgc_base/compactor.o
In file included from …/…/src/heap/cppgc/compactor.cc:5:
In file included from …/…/src/heap/cppgc/compactor.h:8:
…/…/src/heap/cppgc/compaction-worklists.h:8:10: fatal error: ‘unordered_set’ file not found
#include <unordered_set>
^~~~~~~~~~~~~~~
1 error generated.
[8/1243] CXX obj/cppgc_base/concurrent-marker.o
FAILED: obj/cppgc_base/concurrent-marker.o
clang++ -MMD -MF obj/cppgc_base/concurrent-marker.o.d -DUSE_UDEV -DUSE_AURA=1 -DUSE_NSS_CERTS=1 -DUSE_OZONE=1 -DUSE_X11=1 -D_FILE_OFFSET_BITS=64 -D_LARGEFILE_SOURCE -D_LARGEFILE64_SOURCE -D_GNU_SOURCE -DCR_CLANG_REVISION="" -D__STDC_CONSTANT_MACROS -D__STDC_FORMAT_MACROS -D_FORTIFY_SOURCE=2 -DNDEBUG -DNVALGRIND -DDYNAMIC_ANNOTATIONS_ENABLED=0 -DV8_TYPED_ARRAY_MAX_SIZE_IN_HEAP=64 -DENABLE_MINOR_MC -DV8_ATOMIC_OBJECT_FIELD_WRITES -DV8_ATOMIC_MARKING_STATE -DV8_ENABLE_LAZY_SOURCE_POSITIONS -DV8_WIN64_UNWINDING_INFO -DV8_ENABLE_REGEXP_INTERPRETER_THREADED_DISPATCH -DV8_SNAPSHOT_COMPRESSION -DV8_SHORT_BUILTIN_CALLS -DV8_ENABLE_SYSTEM_INSTRUMENTATION -DV8_ENABLE_WEBASSEMBLY -DV8_COMPRESS_POINTERS -DV8_COMPRESS_POINTERS_IN_ISOLATE_CAGE -DV8_31BIT_SMIS_ON_64BIT_ARCH -DV8_DEPRECATION_WARNINGS -DV8_IMMINENT_DEPRECATION_WARNINGS -DCPPGC_CAGED_HEAP -DV8_TARGET_ARCH_X64 -DV8_HAVE_TARGET_OS -DV8_TARGET_OS_LINUX -DDISABLE_UNTRUSTED_CODE_MITIGATIONS -DV8_COMPRESS_POINTERS -DV8_COMPRESS_POINTERS_IN_ISOLATE_CAGE -DV8_31BIT_SMIS_ON_64BIT_ARCH -DV8_DEPRECATION_WARNINGS -DV8_IMMINENT_DEPRECATION_WARNINGS -DCPPGC_CAGED_HEAP -DV8_COMPRESS_POINTERS -DV8_COMPRESS_POINTERS_IN_ISOLATE_CAGE -DV8_31BIT_SMIS_ON_64BIT_ARCH -DV8_DEPRECATION_WARNINGS -DV8_IMMINENT_DEPRECATION_WARNINGS -DCPPGC_CAGED_HEAP -I…/… -Igen -I…/… -I…/…/include -Igen -Igen/include -Igen/include -I…/…/include -fno-delete-null-pointer-checks -fno-ident -fno-strict-aliasing --param=ssp-buffer-size=4 -fstack-protector -funwind-tables -fPIC -pthread -fcolor-diagnostics -fmerge-all-constants -m64 -march=x86-64 -msse3 -Wno-builtin-macro-redefined -D__DATE__= -D__TIME__= -D__TIMESTAMP__= -Xclang -fdebug-compilation-dir -Xclang . -no-canonical-prefixes -Wall -Werror -Wextra -Wimplicit-fallthrough -Wunreachable-code -Wthread-safety -Wextra-semi -Wno-missing-field-initializers -Wno-unused-parameter -Wno-c++11-narrowing -Wno-unneeded-internal-declaration -Wno-undefined-var-template -fno-omit-frame-pointer -Wheader-hygiene -Wstring-conversion -Wtautological-overlap-compare -Wmissing-field-initializers -Wunreachable-code -Wshorten-64-to-32 -O3 -fdata-sections -ffunction-sections -g1 -fvisibility=default -Wexit-time-destructors -std=c++14 -fno-trigraphs -Wno-trigraphs -fno-exceptions -fno-rtti -stdlib=libc++ -Wno-unused-variable -Wno-sign-compare -Wno-deprecated-copy -Wno-unknown-warning-option -Wno-range-loop-analysis -Wno-shorten-64-to-32 -Wno-implicit-int-float-conversion -Wno-builtin-assume-aligned-alignment -Wno-final-dtor-non-final-class -c …/…/src/heap/cppgc/concurrent-marker.cc -o obj/cppgc_base/concurrent-marker.o
In file included from …/…/src/heap/cppgc/concurrent-marker.cc:5:
In file included from …/…/src/heap/cppgc/concurrent-marker.h:8:
In file included from …/…/include/cppgc/platform.h:8:
…/…/include/v8-platform.h:11:10: fatal error: ‘memory’ file not found
#include
^~~~~~~~
1 error generated.
ninja: build stopped: subcommand failed.
Target @com_googlesource_chromium_v8//:build failed to build
Use --verbose_failures to see the command lines of failed build steps.
INFO: Elapsed time: 2.999s, Critical Path: 2.50s
INFO: 2 processes: 2 internal.
FAILED: Build did NOT complete successfully
make: *** [Makefile.core.mk:74: build] Error 1